首页
学习
活动
专区
圈层
工具
发布
社区首页 >问答首页 >Qt无法编译(10.5 Intel Mac)

问Qt无法编译(10.5 Intel Mac)
EN

Stack Overflow用户
提问于 2010-05-27 04:36:29
回答 1查看 286关注 0票数 0

我正在尝试为mac编译Qt的最新版本(来自Gitorius)。当我尝试编译这个代码(通过执行./configure,然后执行make)时,我在运行make时得到以下错误:

代码语言:javascript
复制
../../include/QtCore/../../src/corelib/kernel/qvariant.h: In function ‘T qvariant_cast(const QVariant&) [with T = QVariant]’:
../../include/QtCore/../../src/corelib/kernel/qvariant.h:592: error: ‘QVariant’ is not a member of ‘QMetaType’
make[2]: *** [.pch/debug-shared/QtCore_debug.gch/objective-c++] Error 1
make[1]: *** [debug-all] Error 2
make: *** [sub-corelib-make_default-ordered] Error 2

谢谢。

EN

回答 1

Stack Overflow用户

回答已采纳

发布于 2010-05-27 05:14:43

你下载了一个稳定的版本吗?因为您可能意外地从Because下载了测试版/不稳定版,该版本可能无法编译

另外,只需从ftp.trolltech.com下载一个合适的稳定版本tarball并进行编译即可。

票数 2
EN
页面原文内容由Stack Overflow提供。腾讯云小微IT领域专用引擎提供翻译支持
原文链接:

https://stackoverflow.com/questions/2916592

复制
相关文章

相似问题

领券
问题归档专栏文章快讯文章归档关键词归档开发者手册归档开发者手册 Section 归档